Target
ATP-binding cassette sub-family C member 3
Ligand
BDBM50422542
Substrate
Meas. Tech.
ChEMBL_1678646 (CHEMBL4028923)
IC50
>133000±n/a nM
Citation
 Morgan, REvan Staden, CJChen, YKalyanaraman, NKalanzi, JDunn, RTAfshari, CAHamadeh, HK A multifactorial approach to hepatobiliary transporter assessment enables improved therapeutic compound development. Toxicol Sci 136:216-41 (2013)  
Target
Name:
ATP-binding cassette sub-family C member 3
Synonyms:
ABCC3 CMOAT2 MLP2 MRP3 Multi-specific organic anion transporter D | Multidrug resistance-associated protein 3
Type:
PROTEIN
Mol. Mass.:
169352.45
Organism:
Homo sapiens (Human)
Description:
ChEMBL_735421
Residue:
1527
  
Inhibitor
Name:
BDBM50422542
Synonyms:
Keppra LEVETIRACETAM UCB-22059 | UCB-L059
Type:
Small organic molecule
Emp. Form.:
C8H14N2O2
Mol. Mass.:
170.209
SMILES:
CC[C@H](N1CCCC1=O)C(N)=O
: