Target
ATP-binding cassette sub-family C member 4
Ligand
BDBM50302828
Substrate
Meas. Tech.
ChEMBL_1678647 (CHEMBL4028924)
IC50
13500±n/a nM
Citation
 Morgan, REvan Staden, CJChen, YKalyanaraman, NKalanzi, JDunn, RTAfshari, CAHamadeh, HK A multifactorial approach to hepatobiliary transporter assessment enables improved therapeutic compound development. Toxicol Sci 136:216-41 (2013)  
Target
Name:
ATP-binding cassette sub-family C member 4
Synonyms:
ABCC4 MOAT-B MRP/cMOAT-related ABC transporter MRP4_HUMAN Multidrug resistance-associated protein 4
Type:
PROTEIN
Mol. Mass.:
149546.12
Organism:
Homo sapiens (Human)
Description:
ChEMBL_1486828
Residue:
1325
  
Inhibitor
Name:
BDBM50302828
Synonyms:
2-(4-(4-(butylcarbamoyl)-2-(2,4-dichlorophenylsulfonamido)phenoxy)-3-methoxyphenyl)acetic acid | CHEMBL589973
Type:
Small organic molecule
Emp. Form.:
C26H26Cl2N2O7S
Mol. Mass.:
581.465
SMILES:
CCCCNC(=O)c1ccc(Oc2ccc(CC(O)=O)cc2OC)c(NS(=O)(=O)c2ccc(Cl)cc2Cl)c1
: