Target
ATP-binding cassette sub-family C member 3
Ligand
BDBM50248298
Substrate
Meas. Tech.
ChEMBL_1678646 (CHEMBL4028923)
IC50
80900±n/a nM
Citation
 Morgan, REvan Staden, CJChen, YKalyanaraman, NKalanzi, JDunn, RTAfshari, CAHamadeh, HK A multifactorial approach to hepatobiliary transporter assessment enables improved therapeutic compound development. Toxicol Sci 136:216-41 (2013)  
Target
Name:
ATP-binding cassette sub-family C member 3
Synonyms:
ABCC3 CMOAT2 MLP2 MRP3 Multi-specific organic anion transporter D | Multidrug resistance-associated protein 3
Type:
PROTEIN
Mol. Mass.:
169352.45
Organism:
Homo sapiens (Human)
Description:
ChEMBL_735421
Residue:
1527
  
Inhibitor
Name:
BDBM50248298
Synonyms:
CHEBI:45304 Priftin | Rifapentine
Type:
Small organic molecule
Emp. Form.:
C47H64N4O12
Mol. Mass.:
877.0307
SMILES:
[H][C@]1(OC(C)=O)[C@H](C)[C@H](O)[C@H](C)[C@@H](O)[C@@H](C)\C=C\C=C(C)/C(=O)Nc2c(O)c3c(O)c(C)c4O[C@](C)(O\C=C\[C@H](OC)[C@H]1C)C(=O)c4c3c(O)c2\C=N\N1CCN(CC1)C1CCCC1
: