Target
Bile salt export pump
Ligand
BDBM50085042
Substrate
Meas. Tech.
ChEMBL_1678644 (CHEMBL4028921)
IC50
15300±n/a nM
Citation
 Morgan, REvan Staden, CJChen, YKalyanaraman, NKalanzi, JDunn, RTAfshari, CAHamadeh, HK A multifactorial approach to hepatobiliary transporter assessment enables improved therapeutic compound development. Toxicol Sci 136:216-41 (2013)  
Target
Name:
Bile salt export pump
Synonyms:
ABCB11 ATP-binding cassette sub-family B member 11 Bile Salt Export Pump, BSEP Bile salt export pump (BSEP)
Type:
Protein
Mol. Mass.:
146405.49
Organism:
Homo sapiens (Human)
Description:
O95342
Residue:
1321
  
Inhibitor
Name:
BDBM50085042
Synonyms:
2-(4-(4-Chlorobenzoyl)phenoxy)-2-methylpropanoic acid 1-methylethyl ester FENOFIBRATE Fenofibric acid Isopropyl (4'-(p-chlorobenzoyl)-2-phenoxy-2-methyl)propionate Lipantil (TN) Tricor (TN) | propan-2-yl 2-[4-(4-chlorobenzoyl)phenoxy]-2-methylpropanoate
Type:
Small organic molecule
Emp. Form.:
C20H21ClO4
Mol. Mass.:
360.831
SMILES:
CC(C)OC(=O)C(C)(C)Oc1ccc(cc1)C(=O)c1ccc(Cl)cc1
: