Target
5-hydroxytryptamine receptor 1A
Ligand
BDBM50005090
Substrate
Meas. Tech.
ChEMBL_1313 (CHEMBL616690)
Ki
779±n/a nM
Citation
 Tomaszewski, ZJohnson, MPHuang, XNichols, DE Benzofuran bioisosteres of hallucinogenic tryptamines. J Med Chem 35:2061-4 (1992)  
Target
Name:
5-hydroxytryptamine receptor 1A
Synonyms:
5-HT-1A 5-HT1A 5-hydroxytryptamine receptor 1A (5HT1A) 5ht1a Htr1a Serotonin 1a (5-HT1a) receptor/Adrenergic receptor alpha-1 | Serotonin receptor 1A
Type:
G Protein-Coupled Receptor (GPCR)
Mol. Mass.:
46445.29
Organism:
Rattus norvegicus (rat)
Description:
Binding assays were performed using rat hippocampal membranes.
Residue:
422
  
Inhibitor
Name:
BDBM50005090
Synonyms:
2-(5-Methoxy-benzofuran-3-yl)-1-methyl-ethylamine | CHEMBL304628
Type:
Small organic molecule
Emp. Form.:
C12H15NO2
Mol. Mass.:
205.253
SMILES:
COc1ccc2occ(CC(C)N)c2c1
: