Target
Sphingosine 1-phosphate receptor 3
Ligand
BDBM50147714
Substrate
Meas. Tech.
ChEMBL_1679176 (CHEMBL4029453)
IC50
0.710000±n/a nM
Citation
 Dyckman, AJ Modulators of Sphingosine-1-phosphate Pathway Biology: Recent Advances of Sphingosine-1-phosphate Receptor 1 (S1P J Med Chem 60:5267-5289 (2017)  
Target
Name:
Sphingosine 1-phosphate receptor 3
Synonyms:
C9orf108 EDG3 S1P receptor 3 S1P3 S1PR3_HUMAN Sphingosine 1-phosphate receptor 3 (S1P3) | Sphingosine 1-phosphate receptor Edg-3
Type:
G Protein-Coupled Receptor (GPCR)
Mol. Mass.:
42278.13
Organism:
Homo sapiens (Human)
Description:
Q99500
Residue:
378
  
Inhibitor
Name:
BDBM50147714
Synonyms:
CHEMBL432067 | Phosphoric acid mono-[2-amino-4-(4-octyl-phenyl)-butyl] ester
Type:
Small organic molecule
Emp. Form.:
C18H32NO4P
Mol. Mass.:
357.4247
SMILES:
CCCCCCCCc1ccc(CCC(N)COP(O)(O)=O)cc1
: