Target
5-hydroxytryptamine receptor 1A
Ligand
BDBM50005125
Substrate
Meas. Tech.
ChEBML_1164
Ki
>100000±n/a nM
Citation
 Mokrosz, JLPietrasiewicz, MDuszynska, BCegla, MT Structure-activity relationship studies of central nervous system agents. 5. Effect of the hydrocarbon chain on the affinity of 4-substituted 1-(3-chlorophenyl)piperazines for 5-HT1A receptor site. J Med Chem 35:2369-74 (1992)  
Target
Name:
5-hydroxytryptamine receptor 1A
Synonyms:
5-HT-1A 5-HT1A 5-hydroxytryptamine receptor 1A (5HT1A) 5ht1a Htr1a Serotonin 1a (5-HT1a) receptor/Adrenergic receptor alpha-1 | Serotonin receptor 1A
Type:
G Protein-Coupled Receptor (GPCR)
Mol. Mass.:
46445.29
Organism:
Rattus norvegicus (rat)
Description:
Binding assays were performed using rat hippocampal membranes.
Residue:
422
  
Inhibitor
Name:
BDBM50005125
Synonyms:
1-[4-(3-Chloro-phenyl)-piperazin-1-yl]-2-methyl-propan-1-one | CHEMBL26904
Type:
Small organic molecule
Emp. Form.:
C14H19ClN2O
Mol. Mass.:
266.766
SMILES:
CC(C)C(=O)N1CCN(CC1)c1cccc(Cl)c1
: