Target
Thymidylate synthase
Ligand
BDBM50005333
Substrate
Meas. Tech.
ChEBML_208947
Ki
8500±n/a nM
Citation
 Reich, SHFuhry, MANguyen, DPino, MJWelsh, KMWebber, SJanson, CAJordan, SRMatthews, DASmith, WW Design and synthesis of novel 6,7-imidazotetrahydroquinoline inhibitors of thymidylate synthase using iterative protein crystal structure analysis. J Med Chem 35:847-58 (1992)  
Target
Name:
Thymidylate synthase
Synonyms:
TS Thymidylate Synthase (TS) thyA
Type:
Mol. Mass.:
30487.86
Organism:
Escherichia coli
Description:
Residue:
264
  
Inhibitor
Name:
BDBM50005333
Synonyms:
CHEMBL169726 | [5-(4-Benzenesulfonyl-benzyl)-5,6,7,8-tetrahydro-1H-imidazo[4,5-g]quinolin-2-yl]-methyl-amine
Type:
Small organic molecule
Emp. Form.:
C24H24N4O2S
Mol. Mass.:
432.538
SMILES:
CNc1nc2cc3CCCN(Cc4ccc(cc4)S(=O)(=O)c4ccccc4)c3cc2[nH]1
: