Target
Thymidylate synthase
Ligand
BDBM50005334
Substrate
Meas. Tech.
ChEBML_209652
Ki
4200±n/a nM
Citation
 Reich, SHFuhry, MANguyen, DPino, MJWelsh, KMWebber, SJanson, CAJordan, SRMatthews, DASmith, WW Design and synthesis of novel 6,7-imidazotetrahydroquinoline inhibitors of thymidylate synthase using iterative protein crystal structure analysis. J Med Chem 35:847-58 (1992)  
Target
Name:
Thymidylate synthase
Synonyms:
TS TYMS Thymidylate synthase (TS) | Thymidylate synthase/GAR transformylase/AICAR transformylase
Type:
Enzyme
Mol. Mass.:
35718.07
Organism:
Homo sapiens (Human)
Description:
Residue:
313
  
Inhibitor
Name:
BDBM50005334
Synonyms:
5-(4-Benzenesulfonyl-benzyl)-2-methylsulfanyl-5,6,7,8-tetrahydro-1H-imidazo[4,5-g]quinoline | CHEMBL172176
Type:
Small organic molecule
Emp. Form.:
C24H23N3O2S2
Mol. Mass.:
449.588
SMILES:
CSc1nc2cc3CCCN(Cc4ccc(cc4)S(=O)(=O)c4ccccc4)c3cc2[nH]1
: