Target
Muscarinic acetylcholine receptor M3
Ligand
BDBM50005686
Substrate
Meas. Tech.
ChEMBL_138702 (CHEMBL747817)
Ki
9.9±n/a nM
Citation
 Leader, HGordon, RKBaumgold, JBoyd, VLNewman, AHSmejkal, RMChiang, PK Muscarinic receptor subtype specificity of (N,N-dialkylamino)alkyl 2-cyclohexyl-2-phenylpropionates: cylexphenes (cyclohexyl-substituted aprophen analogues). J Med Chem 35:1290-5 (1992)  
Target
Name:
Muscarinic acetylcholine receptor M3
Synonyms:
ACM3_HUMAN Cholinergic, muscarinic M3 Muscarinic receptor M3 | RecName: Full=Muscarinic acetylcholine receptor M3
Type:
Enzyme
Mol. Mass.:
66151.03
Organism:
Homo sapiens (Human)
Description:
P20309
Residue:
590
  
Inhibitor
Name:
BDBM50005686
Synonyms:
2-Cyclohexyl-2-phenyl-propionic acid 2-diethylamino-ethyl ester | CHEMBL443780
Type:
Small organic molecule
Emp. Form.:
C21H33NO2
Mol. Mass.:
331.4922
SMILES:
CCN(CC)CCOC(=O)C(C)(C1CCCCC1)c1ccccc1
: