Target
Aldo-keto reductase family 1 member B1
Ligand
BDBM50006406
Substrate
Meas. Tech.
ChEBML_31912
IC50
1800±n/a nM
Citation
 Yamagishi, MYamada, YOzaki, KAsao, MShimizu, RSuzuki, MMatsumoto, MMatsuoka, YMatsumoto, K Biological activities and quantitative structure-activity relationships of spiro[imidazolidine-4,4'(1'H)-quinazoline]-2,2',5(3'H)-triones as aldose reductase inhibitors. J Med Chem 35:2085-94 (1992)  
Target
Name:
Aldo-keto reductase family 1 member B1
Synonyms:
AKR1B1 ALDR_HUMAN AR Aldose Reductase (ALR2) Aldose reductase (AR)
Type:
Protein
Mol. Mass.:
35855.50
Organism:
Homo sapiens (Human)
Description:
P15121. 4LAU; 2IKI; 4LB4; 2FZD; 2FZ8; 1US0
Residue:
316
  
Inhibitor
Name:
BDBM50006406
Synonyms:
7-methylspiro[5,6,7,8-tetrahydro[1,3]dioxolo[4,5-g]quinazoline-8,4'-(tetrahydro-1'H-imidazole)]-2',5',6-trione | CHEMBL305353
Type:
Small organic molecule
Emp. Form.:
C12H10N4O5
Mol. Mass.:
290.2316
SMILES:
CN1C(=O)Nc2cc3OCOc3cc2C11NC(=O)NC1=O
: