Target
Renin
Ligand
BDBM50006429
Substrate
Meas. Tech.
ChEBML_196103
IC50
41±n/a nM
Citation
 Ashton, WTCantone, CLMeurer, LCTolman, RLGreenlee, WJPatchett, AALynch, RJSchorn, TWStrouse, JFSiegl, PK Renin inhibitors containing C-termini derived from mercaptoheterocycles. J Med Chem 35:2103-12 (1992)  
Target
Name:
Renin
Synonyms:
Angiotensinogenase RENI_HUMAN
Type:
Enzyme
Mol. Mass.:
45058.99
Organism:
Homo sapiens (Human)
Description:
Residue:
406
  
Inhibitor
Name:
BDBM50006429
Synonyms:
CHEMBL302984 | {1-[1-{1-Cyclohexylmethyl-2-hydroxy-3-[4-(2-pyridin-4-yl-ethyl)-5-trifluoromethyl-4H-[1,2,4]triazol-3-ylsulfanyl]-propylcarbamoyl}-2-(1H-imidazol-4-yl)-ethylcarbamoyl]-2-phenyl-ethyl}-carbamic acid tert-butyl ester; hydrate
Type:
Small organic molecule
Emp. Form.:
C40H52F3N9O5S
Mol. Mass.:
827.958
SMILES:
CC(C)(C)OC(=O)N[C@@H](Cc1ccccc1)C(=O)N[C@@H](Cc1cnc[nH]1)C(=O)N[C@@H](CC1CCCCC1)[C@@H](O)CSc1nnc(n1CCc1ccncc1)C(F)(F)F
: