Target
Aldo-keto reductase family 1 member B1
Ligand
BDBM50006471
Substrate
Meas. Tech.
ChEBML_31769
IC50
5.2±n/a nM
Citation
 Mylari, BLZembrowski, WJBeyer, TAAldinger, CESiegel, TW Orally active aldose reductase inhibitors: indazoleacetic, oxopyridazineacetic, and oxopyridopyridazineacetic acid derivatives. J Med Chem 35:2155-62 (1992)  
Target
Name:
Aldo-keto reductase family 1 member B1
Synonyms:
AKR1B1 ALDR_HUMAN AR Aldose Reductase (ALR2) Aldose reductase (AR)
Type:
Protein
Mol. Mass.:
35855.50
Organism:
Homo sapiens (Human)
Description:
P15121. 4LAU; 2IKI; 4LB4; 2FZD; 2FZ8; 1US0
Residue:
316
  
Inhibitor
Name:
BDBM50006471
Synonyms:
CHEMBL68580 | [4-Oxo-3-(5-trifluoromethyl-benzothiazol-2-ylmethyl)-3,4,5,6,7,8-hexahydro-phthalazin-1-yl]-acetic acid
Type:
Small organic molecule
Emp. Form.:
C19H16F3N3O3S
Mol. Mass.:
423.409
SMILES:
OC(=O)Cc1nn(Cc2nc3cc(ccc3s2)C(F)(F)F)c(=O)c2CCCCc12
: