Target
Muscarinic acetylcholine receptor M3
Ligand
BDBM50453183
Substrate
Meas. Tech.
ChEBML_138852
Ki
0.522000±n/a nM
Citation
 Carroll, FIAbraham, PChemburkar, SHe, XCMascarella, SWKwon, YWTriggle, DJ Synthesis and muscarinic receptor activity of ester derivatives of 2-substituted 2-azabicyclo[2.2.1]heptan-5-ol and -6-ol. J Med Chem 35:2184-91 (1992)  
Target
Name:
Muscarinic acetylcholine receptor M3
Synonyms:
ACM3_RAT Chrm-3 | Chrm3
Type:
Enzyme Catalytic Domain
Mol. Mass.:
66086.66
Organism:
RAT
Description:
Cholinergic, muscarinic M3 CHRM3 RAT::P08483
Residue:
589
  
Inhibitor
Name:
BDBM50453183
Synonyms:
CHEMBL2114060
Type:
Small organic molecule
Emp. Form.:
C22H25NO2
Mol. Mass.:
335.4394
SMILES:
CN1CC2CC1C[C@H]2OC(=O)C(C)(c1ccccc1)c1ccccc1
: