Target
Muscarinic acetylcholine receptor M1
Ligand
BDBM50003372
Substrate
Meas. Tech.
ChEBML_138793
IC50
60±n/a nM
Citation
 Sauerberg, POlesen, PHNielsen, STreppendahl, SSheardown, MJHonoré, TMitch, CHWard, JSPike, AJBymaster, FP Novel functional M1 selective muscarinic agonists. Synthesis and structure-activity relationships of 3-(1,2,5-thiadiazolyl)-1,2,5,6-tetrahydro-1-methylpyridines . J Med Chem 35:2274-83 (1992)  
Target
Name:
Muscarinic acetylcholine receptor M1
Synonyms:
ACM1_RAT Chrm-1 cholinergic receptor, muscarinic 1
Type:
Enzyme Catalytic Domain
Mol. Mass.:
51390.46
Organism:
RAT
Description:
P08482
Residue:
460
  
Inhibitor
Name:
BDBM50003372
Synonyms:
CHEMBL308168 | Hexyl-[4-(1-methyl-1,2,5,6-tetrahydro-pyridin-3-yl)-[1,2,5]thiadiazol-3-yl]-amine
Type:
Small organic molecule
Emp. Form.:
C14H24N4S
Mol. Mass.:
280.432
SMILES:
CCCCCCNc1nsnc1C1=CCCN(C)C1
: