Target
Muscarinic acetylcholine receptor M1
Ligand
BDBM50004656
Substrate
Meas. Tech.
ChEMBL_138797 (CHEMBL751533)
IC50
1380±n/a nM
Citation
 Sauerberg, POlesen, PHNielsen, STreppendahl, SSheardown, MJHonoré, TMitch, CHWard, JSPike, AJBymaster, FP Novel functional M1 selective muscarinic agonists. Synthesis and structure-activity relationships of 3-(1,2,5-thiadiazolyl)-1,2,5,6-tetrahydro-1-methylpyridines . J Med Chem 35:2274-83 (1992)  
Target
Name:
Muscarinic acetylcholine receptor M1
Synonyms:
ACM1_RAT Chrm-1 cholinergic receptor, muscarinic 1
Type:
Enzyme Catalytic Domain
Mol. Mass.:
51390.46
Organism:
RAT
Description:
P08482
Residue:
460
  
Inhibitor
Name:
BDBM50004656
Synonyms:
(2-Carbamoyloxy-ethyl)-trimethyl-ammonium (2-Hydroxyethyl)trimethyl ammonium chloride carbamate (carbachol)(2-Carbamoyloxy-ethyl)-trimethyl-ammonium 2-((Aminocarbonyl)oxy)-N,N,N-trimethylethanaminum chloride 2-(carbamoyloxy)-N,N,N-trimethylethanaminium chloride CARBASTAT Carbachol chloride Choline carbamate chloride Choline chlorine carbamate Karbamoylcholin chlorid | MIOSTAT
Type:
Small organic molecule
Emp. Form.:
C6H15N2O2
Mol. Mass.:
147.195
SMILES:
C[N+](C)(C)CCOC(N)=O
: