Target
Kappa-type opioid receptor
Ligand
BDBM50006996
Substrate
Meas. Tech.
ChEMBL_145370 (CHEMBL753138)
IC50
29±n/a nM
Citation
 Freeman, JPMichalson, ETD'Andrea, SVBaczynskyj, LVon Voigtlander, PFLahti, RASmith, MWLawson, CFScahill, TAMizsak, SA Naphtho and benzo analogues of the kappa opioid agonist trans-(+/-)-3,4-dichloro-N-methyl-N-[2-(1-pyrrolidinyl)cyclohexyl] benzeneacetamide. J Med Chem 34:1891-6 (1991)  
Target
Name:
Kappa-type opioid receptor
Synonyms:
KOR-1 OPIATE Kappa Oprk1
Type:
Enzyme
Mol. Mass.:
42656.78
Organism:
Mus musculus (Mouse)
Description:
P33534
Residue:
380
  
Inhibitor
Name:
BDBM50006996
Synonyms:
3,4-Dichloro-N-methyl-N-(3-pyrrolidin-1-yl-1,2,3,4-tetrahydro-naphthalen-2-yl)-benzamide | CHEMBL55421
Type:
Small organic molecule
Emp. Form.:
C22H24Cl2N2O
Mol. Mass.:
403.345
SMILES:
CN([C@@H]1Cc2ccccc2C[C@H]1N1CCCC1)C(=O)c1ccc(Cl)c(Cl)c1
: