Target
Kappa-type opioid receptor
Ligand
BDBM50453071
Substrate
Meas. Tech.
ChEBML_145209
IC50
74±n/a nM
Citation
 Klein, PNelson, WL Electrophilic gamma-lactone kappa-opioid receptor probes. Analogues of 2'-hydroxy-2-tetrahydrofurfuryl-5,9-dimethyl-6,7-benzomorphan diastereomers. J Med Chem 34:2438-44 (1991)  
Target
Name:
Kappa-type opioid receptor
Synonyms:
Kappa Opioid Receptor OPRK1 Opiate Kappa 1 | mu/kappa opioid receptor
Type:
G Protein-Coupled Receptor (GPCR)
Mol. Mass.:
42744.99
Organism:
Cavia porcellus (domestic guinea pig)
Description:
P41144
Residue:
380
  
Inhibitor
Name:
BDBM50453071
Synonyms:
CHEMBL2367758
Type:
Small organic molecule
Emp. Form.:
C19H23NO3
Mol. Mass.:
313.3908
SMILES:
[H][C@]12Cc3ccc(O)cc3[C@@](C)(CCN1C[C@@H]1OC(=O)C=C1)[C@H]2C
: