Target
D(2) dopamine receptor
Ligand
BDBM50007141
Substrate
Meas. Tech.
ChEMBL_62257 (CHEMBL675484)
Ki
2610±n/a nM
Citation
 DeNinno, MPSchoenleber, RPerner, RJLijewski, LAsin, KEBritton, DRMacKenzie, RKebabian, JW Synthesis and dopaminergic activity of 3-substituted 1-(aminomethyl)-3,4-dihydro-5,6-dihydroxy-1H-2-benzopyrans: characterization of an auxiliary binding region in the D1 receptor. J Med Chem 34:2561-9 (1991)  
Target
Name:
D(2) dopamine receptor
Synonyms:
DOPAMINE D2 DOPAMINE D2 Short Dopamine D2 receptor Drd2
Type:
G Protein-Coupled Receptor (GPCR)
Mol. Mass.:
50931.60
Organism:
Rattus norvegicus (rat)
Description:
P61169
Residue:
444
  
Inhibitor
Name:
BDBM50007141
Synonyms:
1-Aminomethyl-3-benzhydryl-isochroman-5,6-diol | CHEMBL87172
Type:
Small organic molecule
Emp. Form.:
C23H23NO3
Mol. Mass.:
361.4336
SMILES:
NC[C@@H]1OC(Cc2c(O)c(O)ccc12)C(c1ccccc1)c1ccccc1
: