Target
Beta-1 adrenergic receptor
Ligand
BDBM50007136
Substrate
Meas. Tech.
ChEBML_218252
Ki
>10000±n/a nM
Citation
 DeNinno, MPSchoenleber, RPerner, RJLijewski, LAsin, KEBritton, DRMacKenzie, RKebabian, JW Synthesis and dopaminergic activity of 3-substituted 1-(aminomethyl)-3,4-dihydro-5,6-dihydroxy-1H-2-benzopyrans: characterization of an auxiliary binding region in the D1 receptor. J Med Chem 34:2561-9 (1991)  
Target
Name:
Beta-1 adrenergic receptor
Synonyms:
ADRB1R, B1AR Adrb1 Adrenergic receptor beta Beta-1 adrenoreceptor adrenergic Beta1,2
Type:
Protein
Mol. Mass.:
50486.84
Organism:
Rattus norvegicus (Rat)
Description:
P18090
Residue:
466
  
Inhibitor
Name:
BDBM50007136
Synonyms:
1-Aminomethyl-3-phenyl-isochroman-5,6-diol | CHEMBL83080
Type:
Small organic molecule
Emp. Form.:
C16H17NO3
Mol. Mass.:
271.3111
SMILES:
NC[C@H]1O[C@H](Cc2c(O)c(O)ccc12)c1ccccc1
: