Target
5-hydroxytryptamine receptor 1A
Ligand
BDBM50007140
Substrate
Meas. Tech.
ChEBML_1111
Ki
>20000±n/a nM
Citation
 DeNinno, MPSchoenleber, RPerner, RJLijewski, LAsin, KEBritton, DRMacKenzie, RKebabian, JW Synthesis and dopaminergic activity of 3-substituted 1-(aminomethyl)-3,4-dihydro-5,6-dihydroxy-1H-2-benzopyrans: characterization of an auxiliary binding region in the D1 receptor. J Med Chem 34:2561-9 (1991)  
Target
Name:
5-hydroxytryptamine receptor 1A
Synonyms:
5-HT-1A 5-HT1A 5-hydroxytryptamine receptor 1A (5HT1A) 5ht1a Htr1a Serotonin 1a (5-HT1a) receptor/Adrenergic receptor alpha-1 | Serotonin receptor 1A
Type:
G Protein-Coupled Receptor (GPCR)
Mol. Mass.:
46445.29
Organism:
Rattus norvegicus (rat)
Description:
Binding assays were performed using rat hippocampal membranes.
Residue:
422
  
Inhibitor
Name:
BDBM50007140
Synonyms:
1-Allylaminomethyl-3-cyclohexyl-isochroman-5,6-diol | CHEMBL419680
Type:
Small organic molecule
Emp. Form.:
C19H27NO3
Mol. Mass.:
317.4226
SMILES:
Oc1ccc2[C@H](CNCC=C)OC(Cc2c1O)C1CCCCC1
: