Target
5-hydroxytryptamine receptor 1A
Ligand
BDBM50007175
Substrate
Meas. Tech.
ChEBML_1117
Ki
0.700000±n/a nM
Citation
 Raghupathi, RKRydelek-Fitzgerald, LTeitler, MGlennon, RA Analogues of the 5-HT1A serotonin antagonist 1-(2-methoxyphenyl)-4-[4-(2-phthalimido)butyl]piperazine with reduced alpha 1-adrenergic affinity. J Med Chem 34:2633-8 (1991)  
Target
Name:
5-hydroxytryptamine receptor 1A
Synonyms:
5-HT-1A 5-HT1A 5-hydroxytryptamine receptor 1A (5HT1A) 5ht1a Htr1a Serotonin 1a (5-HT1a) receptor/Adrenergic receptor alpha-1 | Serotonin receptor 1A
Type:
G Protein-Coupled Receptor (GPCR)
Mol. Mass.:
46445.29
Organism:
Rattus norvegicus (rat)
Description:
Binding assays were performed using rat hippocampal membranes.
Residue:
422
  
Inhibitor
Name:
BDBM50007175
Synonyms:
Adamantane-1-carboxylic acid [4-(4-naphthalen-1-yl-piperazin-1-yl)-butyl]-amide | CHEMBL410826
Type:
Small organic molecule
Emp. Form.:
C29H39N3O
Mol. Mass.:
445.6395
SMILES:
O=C(NCCCCN1CCN(CC1)c1cccc2ccccc12)C12C[C@H]3C[C@H](C[C@H](C3)C1)C2
: