Target
Sigma non-opioid intracellular receptor 1
Ligand
BDBM50007399
Substrate
Meas. Tech.
ChEBML_201731
Ki
5.4±n/a nM
Citation
 Glennon, RAYousif, MYIsmaiel, AMel-Ashmawy, MBHerndon, JLFischer, JBServer, ACHowie, KJ Novel 1-phenylpiperazine and 4-phenylpiperidine derivatives as high-affinity sigma ligands. J Med Chem 34:3360-5 (1992)  
Target
Name:
Sigma non-opioid intracellular receptor 1
Synonyms:
Aging-associated gene 8 protein SGMR1_HUMAN SIGMAR1 SR31747-binding protein Sigma 1-type opioid receptor Sigma1R | hSigmaR1
Type:
Enzyme Catalytic Domain
Mol. Mass.:
25124.85
Organism:
Homo sapiens (Human)
Description:
Q99720
Residue:
223
  
Inhibitor
Name:
BDBM50007399
Synonyms:
1-(4-Phenyl-butyl)-4-(3-trifluoromethyl-phenyl)-piperazine | CHEMBL114477
Type:
Small organic molecule
Emp. Form.:
C21H25F3N2
Mol. Mass.:
362.4318
SMILES:
FC(F)(F)c1cccc(c1)N1CCN(CCCCc2ccccc2)CC1
: