Target
Sigma non-opioid intracellular receptor 1
Ligand
BDBM50004308
Substrate
Meas. Tech.
ChEBML_201731
Ki
10480±n/a nM
Citation
 Glennon, RAYousif, MYIsmaiel, AMel-Ashmawy, MBHerndon, JLFischer, JBServer, ACHowie, KJ Novel 1-phenylpiperazine and 4-phenylpiperidine derivatives as high-affinity sigma ligands. J Med Chem 34:3360-5 (1992)  
Target
Name:
Sigma non-opioid intracellular receptor 1
Synonyms:
Aging-associated gene 8 protein SGMR1_HUMAN SIGMAR1 SR31747-binding protein Sigma 1-type opioid receptor Sigma1R | hSigmaR1
Type:
Enzyme Catalytic Domain
Mol. Mass.:
25124.85
Organism:
Homo sapiens (Human)
Description:
Q99720
Residue:
223
  
Inhibitor
Name:
BDBM50004308
Synonyms:
1-Benzoylpiperazine 1-Benzyl-piperazine, 10 CHEMBL113600 | US10166229, Example 00033
Type:
Small organic molecule
Emp. Form.:
C11H16N2
Mol. Mass.:
176.2581
SMILES:
C(N1CCNCC1)c1ccccc1
: