Target
Sigma non-opioid intracellular receptor 1
Ligand
BDBM50007398
Substrate
Meas. Tech.
ChEMBL_201281 (CHEMBL805615)
Ki
3±n/a nM
Citation
 Glennon, RAYousif, MYIsmaiel, AMel-Ashmawy, MBHerndon, JLFischer, JBServer, ACHowie, KJ Novel 1-phenylpiperazine and 4-phenylpiperidine derivatives as high-affinity sigma ligands. J Med Chem 34:3360-5 (1992)  
Target
Name:
Sigma non-opioid intracellular receptor 1
Synonyms:
Aging-associated gene 8 protein SGMR1_HUMAN SIGMAR1 SR31747-binding protein Sigma 1-type opioid receptor Sigma1R | hSigmaR1
Type:
Enzyme Catalytic Domain
Mol. Mass.:
25124.85
Organism:
Homo sapiens (Human)
Description:
Q99720
Residue:
223
  
Inhibitor
Name:
BDBM50007398
Synonyms:
4-Phenyl-1-(3-phenyl-propyl)-piperidin-4-ol CHEMBL115508
Type:
Small organic molecule
Emp. Form.:
C20H25NO
Mol. Mass.:
295.4186
SMILES:
OC1(CCN(CCCc2ccccc2)CC1)c1ccccc1
: