Target
5-hydroxytryptamine receptor 1A
Ligand
BDBM50007693
Substrate
Meas. Tech.
ChEBML_825
IC50
3.8±n/a nM
Citation
 Cipollina, JARuediger, EHNew, JSWire, MEShepherd, TASmith, DWYevich, JP Synthesis and biological activity of the putative metabolites of the atypical antipsychotic agent tiospirone. J Med Chem 34:3316-28 (1991)  
Target
Name:
5-hydroxytryptamine receptor 1A
Synonyms:
5-HT-1A 5-HT1A 5-hydroxytryptamine receptor 1A (5HT1A) 5ht1a Htr1a Serotonin 1a (5-HT1a) receptor/Adrenergic receptor alpha-1 | Serotonin receptor 1A
Type:
G Protein-Coupled Receptor (GPCR)
Mol. Mass.:
46445.29
Organism:
Rattus norvegicus (rat)
Description:
Binding assays were performed using rat hippocampal membranes.
Residue:
422
  
Inhibitor
Name:
BDBM50007693
Synonyms:
8-[4-(4-Benzo[d]isothiazol-3-yl-piperazin-1-yl)-butyl]-2-hydroxy-8-aza-spiro[4.5]decane-7,9-dione (HCl) | CHEMBL114451
Type:
Small organic molecule
Emp. Form.:
C24H32N4O3S
Mol. Mass.:
456.601
SMILES:
OC1CCC2(C1)CC(=O)N(CCCCN1CCN(CC1)c1nsc3ccccc13)C(=O)C2
: