Target
Oxidized purine nucleoside triphosphate hydrolase
Ligand
BDBM50255615
Substrate
Meas. Tech.
ChEBML_1687437
IC50
5.0±n/a nM
Citation
 Rahm, FViklund, JTrésaugues, LEllermann, MGiese, AEricsson, UForsblom, RGinman, TGünther, JHallberg, KLindström, JPersson, LBSilvander, CTalagas, ADíaz-Sáez, LFedorov, OHuber, KVMPanagakou, ISiejka, PGorjánácz, MBauser, MAndersson, M Creation of a Novel Class of Potent and Selective MutT Homologue 1 (MTH1) Inhibitors Using Fragment-Based Screening and Structure-Based Drug Design. J Med Chem 61:2533-2551 (2018)  
Target
Name:
Oxidized purine nucleoside triphosphate hydrolase
Synonyms:
7,8-dihydro-8-oxoguanine triphosphatase MTH1 NUDT1
Type:
Protein
Mol. Mass.:
22514.81
Organism:
Homo sapiens (Human)
Description:
P36639
Residue:
197
  
Inhibitor
Name:
BDBM50255615
Synonyms:
CHEMBL4061204
Type:
Small organic molecule
Emp. Form.:
C17H17N3
Mol. Mass.:
263.337
SMILES:
C1CC(N(C1)c1ccnc2[nH]ccc12)c1ccccc1
: