Target
Muscarinic acetylcholine receptor M1
Ligand
BDBM50008068
Substrate
Meas. Tech.
ChEBML_138791
IC50
2100±n/a nM
Citation
 Shapiro, GFloersheim, PBoelsterli, JAmstutz, RBolliger, GGammenthaler, HGmelin, GSupavilai, PWalkinshaw, M Muscarinic activity of the thiolactone, lactam, lactol, and thiolactol analogues of pilocarpine and a hypothetical model for the binding of agonists to the m1 receptor. J Med Chem 35:15-27 (1992)  
Target
Name:
Muscarinic acetylcholine receptor M1
Synonyms:
ACM1_RAT Chrm-1 cholinergic receptor, muscarinic 1
Type:
Enzyme Catalytic Domain
Mol. Mass.:
51390.46
Organism:
RAT
Description:
P08482
Residue:
460
  
Inhibitor
Name:
BDBM50008068
Synonyms:
CHEMBL327819 Methamilane
Type:
Small organic molecule
Emp. Form.:
C7H15NO2
Mol. Mass.:
145.1995
SMILES:
CC1OCC(CN(C)C)O1
: