Target
C5a anaphylatoxin chemotactic receptor 1
Ligand
BDBM50008378
Substrate
Meas. Tech.
ChEBML_41602
Ki
180000±n/a nM
Citation
 Or, YSClark, RFLane, BMollison, KWCarter, GWLuly, JR Improvements in the minimum binding sequence of C5a: examination of His-67. J Med Chem 35:402-6 (1992)  
Target
Name:
C5a anaphylatoxin chemotactic receptor 1
Synonyms:
C5AR C5AR1_HUMAN C5a anaphylatoxin chemotactic receptor C5a-R | CD_antigen=CD88
Type:
Enzyme
Mol. Mass.:
39347.68
Organism:
Homo sapiens (Human)
Description:
P21730
Residue:
350
  
Inhibitor
Name:
BDBM50008378
Synonyms:
CHEMBL129978 | H-His(1Me)-Lys-AspMet-GIn-Leu-Gly-Arg-OH
Type:
Small organic molecule
Emp. Form.:
C41H71N15O12S
Mol. Mass.:
998.161
SMILES:
CSCC[C@H](NC(=O)[C@H](CC(O)=O)NC(=O)[C@H](CCCCN)NC(=O)[C@@H](N)Cc1cncn1C)C(=O)N[C@@H](CCC(N)=O)C(=O)N[C@@H](CC(C)C)C(=O)NCC(=O)N[C@@H](CCCNC(N)=N)C(O)=O
: