Target
Aspartyl aminopeptidase
Ligand
BDBM50008427
Substrate
Meas. Tech.
ChEMBL_32822 (CHEMBL646473)
Ki
1100000±n/a nM
Citation
 Ocain, TDRich, DH alpha-Keto amide inhibitors of aminopeptidases. J Med Chem 35:451-6 (1992)  
Target
Name:
Aspartyl aminopeptidase
Synonyms:
ASPEP Aspartyl aminopeptidase DNPEP | DNPEP_HUMAN
Type:
PROTEIN
Mol. Mass.:
52436.31
Organism:
Homo sapiens (Human)
Description:
ChEMBL_32822
Residue:
475
  
Inhibitor
Name:
BDBM50008427
Synonyms:
5-Amino-2,7-dimethyl-4-oxo-octanoic acid | CHEMBL341941
Type:
Small organic molecule
Emp. Form.:
C10H19NO3
Mol. Mass.:
201.2628
SMILES:
CC(C)C[C@H](N)C(=O)CC(C)C(O)=O
: