Target
Aminopeptidase N
Ligand
BDBM50008427
Substrate
Meas. Tech.
ChEMBL_123004 (CHEMBL729045)
Ki
940000.0±n/a nM
Citation
 Ocain, TDRich, DH alpha-Keto amide inhibitors of aminopeptidases. J Med Chem 35:451-6 (1992)  
Target
Name:
Aminopeptidase N
Synonyms:
AMPN_HUMAN APN Aminopeptidase CD_antigen=CD13 Myeloid plasma membrane glycoprotein CD13 gp150 | hAPN
Type:
PROTEIN
Mol. Mass.:
109522.63
Organism:
Homo sapiens (Human)
Description:
ChEMBL_1507526
Residue:
967
  
Inhibitor
Name:
BDBM50008427
Synonyms:
5-Amino-2,7-dimethyl-4-oxo-octanoic acid | CHEMBL341941
Type:
Small organic molecule
Emp. Form.:
C10H19NO3
Mol. Mass.:
201.2628
SMILES:
CC(C)C[C@H](N)C(=O)CC(C)C(O)=O
: