Target
Aldo-keto reductase family 1 member B1
Ligand
BDBM50008442
Substrate
Meas. Tech.
ChEBML_31764
IC50
32.0±n/a nM
Citation
 Mylari, BLBeyer, TAScott, PJAldinger, CEDee, MFSiegel, TWZembrowski, WJ Potent, orally active aldose reductase inhibitors related to zopolrestat: surrogates for benzothiazole side chain. J Med Chem 35:457-65 (1992)  
Target
Name:
Aldo-keto reductase family 1 member B1
Synonyms:
AKR1B1 ALDR_HUMAN AR Aldose Reductase (ALR2) Aldose reductase (AR)
Type:
Protein
Mol. Mass.:
35855.50
Organism:
Homo sapiens (Human)
Description:
P15121. 4LAU; 2IKI; 4LB4; 2FZD; 2FZ8; 1US0
Residue:
316
  
Inhibitor
Name:
BDBM50008442
Synonyms:
CHEMBL142790 | [3-(5,7-Dichloro-benzooxazol-2-ylmethyl)-4-oxo-3,4-dihydro-phthalazin-1-yl]-acetic acid
Type:
Small organic molecule
Emp. Form.:
C18H11Cl2N3O4
Mol. Mass.:
404.204
SMILES:
OC(=O)Cc1nn(Cc2nc3cc(Cl)cc(Cl)c3o2)c(=O)c2ccccc12
: