Target
Aldo-keto reductase family 1 member B1
Ligand
BDBM50008488
Substrate
Meas. Tech.
ChEBML_31764
IC50
59000±n/a nM
Citation
 Mylari, BLBeyer, TAScott, PJAldinger, CEDee, MFSiegel, TWZembrowski, WJ Potent, orally active aldose reductase inhibitors related to zopolrestat: surrogates for benzothiazole side chain. J Med Chem 35:457-65 (1992)  
Target
Name:
Aldo-keto reductase family 1 member B1
Synonyms:
AKR1B1 ALDR_HUMAN AR Aldose Reductase (ALR2) Aldose reductase (AR)
Type:
Protein
Mol. Mass.:
35855.50
Organism:
Homo sapiens (Human)
Description:
P15121. 4LAU; 2IKI; 4LB4; 2FZD; 2FZ8; 1US0
Residue:
316
  
Inhibitor
Name:
BDBM50008488
Synonyms:
(4-Oxo-3-quinolin-2-ylmethyl-3,4-dihydro-phthalazin-1-yl)-acetic acid | CHEMBL143117
Type:
Small organic molecule
Emp. Form.:
C20H15N3O3
Mol. Mass.:
345.3514
SMILES:
OC(=O)Cc1nn(Cc2ccc3ccccc3n2)c(=O)c2ccccc12
: