Target
Cholecystokinin receptor type A
Ligand
BDBM50008662
Substrate
Meas. Tech.
ChEBML_49718
IC50
810±n/a nM
Citation
 Kerwin, JFWagenaar, FKopecka, HLin, CWMiller, TWitte, DStashko, MNadzan, AM Cholecystokinin antagonists: (R)-tryptophan-based hybrid antagonists of high affinity and selectivity for CCK-A receptors. J Med Chem 34:3350-9 (1992)  
Target
Name:
Cholecystokinin receptor type A
Synonyms:
CCK-A receptor CCK1-R CCKAR_CAVPO Cholecystokinin receptor type A | Cholecystokinin-1 receptor
Type:
Mol. Mass.:
48229.77
Organism:
Cavia porcellus
Description:
Residue:
430
  
Inhibitor
Name:
BDBM50008662
Synonyms:
CHEMBL323627 | Quinoline-3-carboxylic acid [2-(1H-indol-3-yl)-1-(1-phenyl-ethylcarbamoyl)-ethyl]-amide
Type:
Small organic molecule
Emp. Form.:
C29H26N4O2
Mol. Mass.:
462.5423
SMILES:
C[C@@H](NC(=O)[C@@H](Cc1c[nH]c2ccccc12)NC(=O)c1cnc2ccccc2c1)c1ccccc1
: