Target
Gastrin/cholecystokinin type B receptor
Ligand
BDBM50008664
Substrate
Meas. Tech.
ChEBML_47978
IC50
>10000±n/a nM
Citation
 Kerwin, JFWagenaar, FKopecka, HLin, CWMiller, TWitte, DStashko, MNadzan, AM Cholecystokinin antagonists: (R)-tryptophan-based hybrid antagonists of high affinity and selectivity for CCK-A receptors. J Med Chem 34:3350-9 (1992)  
Target
Name:
Gastrin/cholecystokinin type B receptor
Synonyms:
CCK-2 receptor CCK-BR CCKRB Cholecystokinin receptor GASR_HUMAN | Gastrin/cholecystokinin type B receptor
Type:
G Protein-Coupled Receptor (GPCR)
Mol. Mass.:
48445.79
Organism:
Homo sapiens (Human)
Description:
Stable expression of human CCK-2 receptors in HEK 293 cells.
Residue:
447
  
Inhibitor
Name:
BDBM50008664
Synonyms:
(R)-1N-butyl-1N-pentyl-2-(4-chlorosulfonylbenzenecarboxamido)-3-(1H-3-indolyl)-(2R)-propanamide | CHEMBL450883
Type:
Small organic molecule
Emp. Form.:
C28H36ClN3O4S
Mol. Mass.:
546.121
SMILES:
CCCCCN(CCCCC)C(=O)[C@@H](Cc1c[nH]c2ccccc12)NC(=O)S(=O)(=O)c1ccc(Cl)cc1
: