Target
Cholecystokinin receptor type A
Ligand
BDBM50008647
Substrate
Meas. Tech.
ChEBML_49718
IC50
7±n/a nM
Citation
 Kerwin, JFWagenaar, FKopecka, HLin, CWMiller, TWitte, DStashko, MNadzan, AM Cholecystokinin antagonists: (R)-tryptophan-based hybrid antagonists of high affinity and selectivity for CCK-A receptors. J Med Chem 34:3350-9 (1992)  
Target
Name:
Cholecystokinin receptor type A
Synonyms:
CCK-A receptor CCK1-R CCKAR_CAVPO Cholecystokinin receptor type A | Cholecystokinin-1 receptor
Type:
Mol. Mass.:
48229.77
Organism:
Cavia porcellus
Description:
Residue:
430
  
Inhibitor
Name:
BDBM50008647
Synonyms:
4-[(4,8-Dihydroxy-quinoline-2-carbonyl)-amino]-4-dipentylcarbamoyl-butyric acid | CHEMBL322284
Type:
Small organic molecule
Emp. Form.:
C25H35N3O6
Mol. Mass.:
473.5619
SMILES:
CCCCCN(CCCCC)C(=O)[C@@H](CCC(O)=O)NC(=O)c1cc(O)c2cccc(O)c2n1
: