Target
Cysteine protease
Ligand
BDBM50258514
Substrate
Meas. Tech.
ChEBML_1690561
Ki
0.074000±n/a nM
Citation
 Previti, SEttari, RCosconati, SAmendola, GChouchene, KWagner, AHellmich, UAUlrich, KKrauth-Siegel, RLWich, PRSchmid, ISchirmeister, TGut, JRosenthal, PJGrasso, SZappalą, M Development of Novel Peptide-Based Michael Acceptors Targeting Rhodesain and Falcipain-2 for the Treatment of Neglected Tropical Diseases (NTDs). J Med Chem 60:6911-6923 (2017)  
Target
Name:
Cysteine protease
Synonyms:
Rhodesain
Type:
PROTEIN
Mol. Mass.:
48425.78
Organism:
Trypanosoma brucei rhodesiense
Description:
ChEMBL_619861
Residue:
450
  
Inhibitor
Name:
BDBM50258514
Synonyms:
CHEMBL4062015
Type:
Small organic molecule
Emp. Form.:
C30H31N3O6
Mol. Mass.:
529.5836
SMILES:
CC(=O)\C=C\[C@H](CCc1ccccc1)NC(=O)[C@H](Cc1ccccc1)NC(=O)OCc1ccc(cc1)[N+]([O-])=O
: