Target
Thromboxane-A synthase
Ligand
BDBM50008791
Substrate
Meas. Tech.
ChEMBL_210275 (CHEMBL808522)
IC50
>2000±n/a nM
Citation
 Bhagwat, SSGude, CCohen, DSLee, WFurness, PClarke, FH Thromboxane receptor antagonism combined with thromboxane synthase inhibition. 1. (+/-)-(3-pyridinylbicycloheptyl)alkanoic acids. J Med Chem 34:1790-7 (1991)  
Target
Name:
Thromboxane-A synthase
Synonyms:
CYP5 Cytochrome P450 5A1 TBXAS1 TXA synthase TXS Thromboxane A2 Synthase (P450 TxA2) Thromboxane prostanoid Thromboxane-A synthase
Type:
Enzyme
Mol. Mass.:
60524.67
Organism:
Homo sapiens (Human)
Description:
P24557
Residue:
533
  
Inhibitor
Name:
BDBM50008791
Synonyms:
7-(3-Pyridin-3-yl-7-oxa-bicyclo[2.2.1]hept-2-yl)-heptanoic acid | CHEMBL52344
Type:
Small organic molecule
Emp. Form.:
C18H25NO3
Mol. Mass.:
303.396
SMILES:
OC(=O)CCCCCC[C@@H]1C2CCC(O2)C1c1cccnc1
: