Target
Dual specificity protein kinase CLK4
Ligand
BDBM50259410
Substrate
Meas. Tech.
ChEBML_1691313
IC50
59±n/a nM
Citation
 Bendjeddou, LZLoaëc, NVilliers, BPrina, ESpäth, GFGalons, HMeijer, LOumata, N Exploration of the imidazo[1,2-b]pyridazine scaffold as a protein kinase inhibitor. Eur J Med Chem 125:696-709 (2017)  
Target
Name:
Dual specificity protein kinase CLK4
Synonyms:
CDC-like kinase 4 Clk4
Type:
PROTEIN
Mol. Mass.:
57374.39
Organism:
Mus musculus
Description:
ChEMBL_1502248
Residue:
481
  
Inhibitor
Name:
BDBM50259410
Synonyms:
CHEMBL4100956
Type:
Small organic molecule
Emp. Form.:
C15H17N5O
Mol. Mass.:
283.3284
SMILES:
CC[C@@H](CO)Nc1ccc2ncc(-c3cccnc3)n2n1
: