Target
Trypanothione reductase
Ligand
BDBM50259708
Substrate
Meas. Tech.
ChEBML_1691709
Ki
245000±n/a nM
Citation
 Arias, DGHerrera, FEGaray, ASRodrigues, DForastieri, PSLuna, LEBürgi, MDPrieto, CIglesias, AACravero, RMGuerrero, SA Rational design of nitrofuran derivatives: Synthesis and valuation as inhibitors of Trypanosoma cruzi trypanothione reductase. Eur J Med Chem 125:1088-1097 (2017)  
Target
Name:
Trypanothione reductase
Synonyms:
N(1),N(8)-bis(glutathionyl)spermidine reductase TR | TYTR_TRYCR
Type:
Homodimer; oxidoreductase
Mol. Mass.:
53868.26
Organism:
Trypanosoma cruzi
Description:
Residue:
492
  
Inhibitor
Name:
BDBM50259708
Synonyms:
BAY-2502 BAYER-2502 DNDI1613515 Nifurtimox
Type:
Small organic molecule
Emp. Form.:
C10H13N3O5S
Mol. Mass.:
287.292
SMILES:
CC1CS(=O)(=O)CCN1\N=C\c1ccc(o1)[N+]([O-])=O
: