Target
Aromatase
Ligand
BDBM50009606
Substrate
Meas. Tech.
ChEMBL_36057 (CHEMBL645588)
IC50
200±n/a nM
Citation
 Bayer, HBatzl, CHartmann, RWMannschreck, A New aromatase inhibitors. Synthesis and biological activity of pyridyl-substituted tetralone derivatives. J Med Chem 34:2685-91 (1991)  
Target
Name:
Aromatase
Synonyms:
ARO1 CP19A_HUMAN CYP19 CYPXIX Cytochrome P450 19A1 Cytochrome P450-C19 (CYP19) FL cytokine receptor precursor | P-450AROM
Type:
Enzyme
Mol. Mass.:
57888.92
Organism:
Homo sapiens (Human)
Description:
P11511
Residue:
503
  
Inhibitor
Name:
BDBM50009606
Synonyms:
5-Hydroxy-2-pyridin-4-ylmethyl-3,4-dihydro-2H-naphthalen-1-one CHEMBL93828
Type:
Small organic molecule
Emp. Form.:
C16H15NO2
Mol. Mass.:
253.2958
SMILES:
Oc1cccc2C(=O)C(Cc3ccncc3)CCc12
: