Target
Acetylcholinesterase
Ligand
BDBM50035852
Substrate
Meas. Tech.
ChEMBL_1693525 (CHEMBL4044415)
Kd
234000±n/a nM
Citation
 Wei, ZLiu, YQWang, SZYao, LNie, HFWang, YALiu, XYZheng, ZBLi, S Conjugates of salicylaldoximes and peripheral site ligands: Novel efficient nonquaternary reactivators for nerve agent-inhibited acetylcholinesterase. Bioorg Med Chem 25:4497-4505 (2017)  
Target
Name:
Acetylcholinesterase
Synonyms:
ACES_HUMAN Acetylcholinesterase (AChE) | Acetylcholinesterase (human AChE)
Type:
Enzyme
Mol. Mass.:
67792.70
Organism:
Homo sapiens (Human)
Description:
P22303
Residue:
614
  
Inhibitor
Name:
BDBM50035852
Synonyms:
HI-6
Type:
Small organic molecule
Emp. Form.:
C14H16N4O3
Mol. Mass.:
288.3007
SMILES:
NC(=O)c1cc[n+](COC[n+]2ccccc2\C=N\O)cc1
: