Target
Aldo-keto reductase family 1 member B1
Ligand
BDBM50009798
Substrate
Meas. Tech.
ChEBML_157078
IC50
27±n/a nM
Citation
 Mylari, BLLarson, ERBeyer, TAZembrowski, WJAldinger, CEDee, MFSiegel, TWSingleton, DH Novel, potent aldose reductase inhibitors: 3,4-dihydro-4-oxo-3-[[5-(trifluoromethyl)-2-benzothiazolyl] methyl]-1-phthalazineacetic acid (zopolrestat) and congeners. J Med Chem 34:108-22 (1991)  
Target
Name:
Aldo-keto reductase family 1 member B1
Synonyms:
AKR1B1 ALDR_HUMAN AR Aldose Reductase (ALR2) Aldose reductase (AR)
Type:
Protein
Mol. Mass.:
35855.50
Organism:
Homo sapiens (Human)
Description:
P15121. 4LAU; 2IKI; 4LB4; 2FZD; 2FZ8; 1US0
Residue:
316
  
Inhibitor
Name:
BDBM50009798
Synonyms:
(3-Benzothiazol-2-ylmethyl-7-methyl-4-oxo-3,4-dihydro-phthalazin-1-yl)-acetic acid | CHEMBL284018
Type:
Small organic molecule
Emp. Form.:
C19H15N3O3S
Mol. Mass.:
365.406
SMILES:
Cc1ccc2c(c1)c(CC(O)=O)nn(Cc1nc3ccccc3s1)c2=O
: