Target
Renin
Ligand
BDBM50009904
Substrate
Meas. Tech.
ChEMBL_192728 (CHEMBL801755)
IC50
700±n/a nM
Citation
 Doherty, AMKaltenbronn, JSHudspeth, JPRepine, JTRoark, WHSircar, ITinney, FJConnolly, CJHodges, JCTaylor, MD New inhibitors of human renin that contain novel replacements at the P2 site. J Med Chem 34:1258-71 (1991)  
Target
Name:
Renin
Synonyms:
Angiotensinogenase RENI_HUMAN
Type:
Enzyme
Mol. Mass.:
45058.99
Organism:
Homo sapiens (Human)
Description:
Residue:
406
  
Inhibitor
Name:
BDBM50009904
Synonyms:
CHEMBL23501 | {5-{4-[2-(2-Amino-ethyl)-morpholin-4-yl]-1-cyclohexylmethyl-2-hydroxy-4-oxo-butylcarbamoyl}-5-[2-(morpholine-4-sulfonylamino)-3-phenyl-propionylamino]-pent-2-ynyl}-carbamic acid tert-butyl ester
Type:
Small organic molecule
Emp. Form.:
C41H65N7O10S
Mol. Mass.:
848.061
SMILES:
CC(C)(C)OC(=O)NCC#CCC(NC(=O)C(Cc1ccccc1)NS(=O)(=O)N1CCOCC1)C(=O)NC(CC1CCCCC1)[C@@H](O)CC(=O)N1CCOC(CCN)C1
: