Target
Aldo-keto reductase family 1 member B1
Ligand
BDBM50009982
Substrate
Meas. Tech.
ChEBML_32094
IC50
70000±n/a nM
Citation
 DeRuiter, JDavis, RAWandrekar, VGMayfield, CA Relative structure-inhibition analyses of the N-benzoyl and N-(phenylsulfonyl) amino acid aldose reductase inhibitors. J Med Chem 34:2120-6 (1991)  
Target
Name:
Aldo-keto reductase family 1 member B1
Synonyms:
ALDR_RAT Akr1b4 Aldr1
Type:
PROTEIN
Mol. Mass.:
35797.87
Organism:
Rattus norvegicus
Description:
ChEMBL_1512484
Residue:
316
  
Inhibitor
Name:
BDBM50009982
Synonyms:
CHEMBL8798 | [(Naphthalene-2-carbonyl)-amino]-acetic acid
Type:
Small organic molecule
Emp. Form.:
C13H11NO3
Mol. Mass.:
229.2313
SMILES:
OC(=O)CNC(=O)c1ccc2ccccc2c1
: