Target
Sodium channel protein type 5 subunit alpha
Ligand
BDBM50240277
Substrate
Meas. Tech.
ChEBML_1695597
IC50
2.2±n/a nM
Citation
 Wu, YJGuernon, JMcClure, ALuo, GRajamani, RNg, AEaston, ANewton, ABourin, CParker, DMosure, KBarnaby, OSoars, MGKnox, RJMatchett, MPieschl, RHerrington, JChen, PSivarao, DVBristow, LJMeanwell, NABronson, JOlson, RThompson, LADzierba, C Discovery of non-zwitterionic aryl sulfonamides as Na Bioorg Med Chem 25:5490-5505 (2017)  
Target
Name:
Sodium channel protein type 5 subunit alpha
Synonyms:
HH1 SCN5A_HUMAN Sodium channel protein type 5 subunit alpha/beta-1/beta-2 Voltage-gated sodium channel subunit alpha Nav1.5
Type:
Enzyme
Mol. Mass.:
226908.60
Organism:
Homo sapiens (Human)
Description:
Q14524
Residue:
2016
  
Inhibitor
Name:
BDBM50240277
Synonyms:
CHEMBL4061793
Type:
Small organic molecule
Emp. Form.:
C17H20ClFN4O2S2
Mol. Mass.:
430.948
SMILES:
Fc1cc(NCC23CCCN2CCC3)c(Cl)cc1S(=O)(=O)Nc1nccs1
: