Target
Delta-type opioid receptor
Ligand
BDBM50010536
Substrate
Meas. Tech.
ChEBML_145634
IC50
5.2±n/a nM
Citation
 Yoshino, HNakazawa, TArakawa, YKaneko, TTsuchiya, YMatsunaga, MAraki, SIkeda, MYamatsu, KTachibana, S Synthesis and structure-activity relationships of dynorphin A-(1-8) amide analogues. J Med Chem 33:206-12 (1990)  
Target
Name:
Delta-type opioid receptor
Synonyms:
DOR-1 MSL-2 OPRD_MOUSE Oprd1
Type:
Enzyme Catalytic Domain
Mol. Mass.:
40577.25
Organism:
MOUSE
Description:
P32300
Residue:
372
  
Inhibitor
Name:
BDBM50010536
Synonyms:
2-[5-Guanidino-2-(5-guanidino-2-{2-[2-(2-{2-[3-(4-hydroxy-phenyl)-2-methylamino-propionylamino]-acetylamino}-acetylamino)-3-phenyl-propionylamino]-4-methyl-pentanoylamino}-pentanoylamino)-pentanoylamino]-4-methyl-pentanoic acid amide | CHEMBL263031
Type:
Small organic molecule
Emp. Form.:
C47H75N15O9
Mol. Mass.:
994.1935
SMILES:
CN[C@@H](Cc1ccc(O)cc1)C(=O)NCC(=O)NCC(=O)N[C@H](Cc1ccccc1)C(=O)N[C@@H](CC(C)C)C(=O)N[C@@H](CCCNC(N)=N)C(=O)N[C@@H](CCCNC(N)=N)C(=O)N[C@@H](CC(C)C)C(N)=O
: