Target
CAD protein
Ligand
BDBM50010600
Substrate
Meas. Tech.
ChEBML_52879
pH
7.4±n/a
Ki
5070±n/a nM
Comments
extracted
Citation
 Kinder, DHFrank, SKAmes, MM Analogues of carbamyl aspartate as inhibitors of dihydroorotase: preparation of boronic acid transition-state analogues and a zinc chelator carbamylhomocysteine. J Med Chem 33:819-23 (1990)  
Target
Name:
CAD protein
Synonyms:
Aspartate carbamoyltransferase CAD protein Glutamine-dependent carbamoyl-phosphate synthase | PYR1_HUMAN
Type:
PROTEIN
Mol. Mass.:
242977.40
Organism:
Homo sapiens (Human)
Description:
ChEMBL_52877
Residue:
2225
  
Inhibitor
Name:
BDBM50010600
Synonyms:
CHEMBL168878 | Ethyl-3-borono-2-(carbamylamino)propionate
Type:
Small organic molecule
Emp. Form.:
C6H13BN2O5
Mol. Mass.:
203.989
SMILES:
CCOC(=O)C(CB(O)O)NC(N)=O
: