Target
Inosine-5'-monophosphate dehydrogenase 1
Ligand
BDBM50010610
Substrate
Meas. Tech.
ChEBML_89676
IC50
2600±n/a nM
Citation
 Nelson, PHEugui, EWang, CCAllison, AC Synthesis and immunosuppressive activity of some side-chain variants of mycophenolic acid. J Med Chem 33:833-8 (1990)  
Target
Name:
Inosine-5'-monophosphate dehydrogenase 1
Synonyms:
IMDH1_HUMAN IMPD 1 IMPDH-I Inosine Monophosphate Dehydrogenase Type 1 (IMPDH1) | Inosine-5'-monophosphate dehydrogenase (IMPDH)
Type:
Enzyme
Mol. Mass.:
55407.70
Organism:
Homo sapiens (Human)
Description:
Recombinant IMPDH1 expressed in E. coli.
Residue:
514
  
Inhibitor
Name:
BDBM50010610
Synonyms:
3-[2,2-Difluoro-3-(4-hydroxy-6-methoxy-7-methyl-3-oxo-1,3-dihydro-isobenzofuran-5-ylmethyl)-1-methyl-cyclopropyl]-propionic acid | CHEMBL165934
Type:
Small organic molecule
Emp. Form.:
C18H20F2O6
Mol. Mass.:
370.3446
SMILES:
COc1c(C)c2COC(=O)c2c(O)c1CC1C(F)(F)C1(C)CCC(O)=O
: