Target
D(2) dopamine receptor
Ligand
BDBM50007534
Substrate
Meas. Tech.
ChEBML_61757
IC50
12±n/a nM
Citation
 Högberg, Tde Paulis, TJohansson, LKumar, YHall, HOgren, SO Potential antipsychotic agents. 7. Synthesis and antidopaminergic properties of the atypical highly potent (S)-5-bromo-2,3-dimethoxy-N-[(1-ethyl-2-pyrrolidinyl)methyl]benzamide and related compounds. A comparative study. J Med Chem 33:2305-9 (1990)  
Target
Name:
D(2) dopamine receptor
Synonyms:
DOPAMINE D2 DOPAMINE D2 Short Dopamine D2 receptor Drd2
Type:
G Protein-Coupled Receptor (GPCR)
Mol. Mass.:
50931.60
Organism:
Rattus norvegicus (rat)
Description:
P61169
Residue:
444
  
Inhibitor
Name:
BDBM50007534
Synonyms:
3-Bromo-N-((S)-1-ethyl-pyrrolidin-2-ylmethyl)-2-hydroxy-6-methoxy-benzamide A 35043 | CHEMBL283099
Type:
Small organic molecule
Emp. Form.:
C15H21BrN2O3
Mol. Mass.:
357.243
SMILES:
CCN1CCC[C@H]1CNC(=O)c1c(O)c(Br)ccc1OC
: